{"text_format":"1","workbook":"xlsx","n_sheets":2,"sheets":["Alunos","Sorteio"],"not_rendered":{"charts":0,"images":0,"macros":1,"external_links":0,"defined_names":1,"comments":0,"pivot_tables":0},"unopened":[],"bounds":{"document_bytes":16777216,"sheet_cells":100000,"rows_first":2000,"rows_last":500,"rows_between":2000,"halvings":0,"cell_chars":16384,"cell_head_chars":4096},"cells_cut":0,"cells_raw":0,"read":"whole","date_system":"1900"}

{"sheet":"Alunos","index":0,"n_rows":61,"n_cols":4,"rows_kept":61,"cut":false,"hidden":false,"merged":[]}
[1,"Nome","Email","Fone"]
[2,"ADELAINE BRANDAO SOARES (10028001201)"]
[3,"ALEXANDRO SOUZA DE OLIVEIRA (09028002901)"]
[4,"ANA CARLA MOREIRA DO VALE (10028002501)"]
[5,"ANDREW FELIPE LIMA SILVA (10028001501)"]
[6,"ANGELICA KETLIN SOARES LEITE (11028003701)"]
[7,"ANTONIA NADIA PEREIRA DE ALMEIDA (11028002701)"]
[8,"ANTONIO CARLOS DA SILVA JUNIOR (11028001701)"]
[9,"ARILTON EVANGELISTA COELHO DA SILVA (12028002701)"]
[10,"BRENO ALBER ERRUAS REIS (08028003001)"]
[11,"CAMILA BARROS FONSECA (11028002601)"]
[12,"CELSO SOEIRO FERNANDES (10028000601)"]
[13,"DANILO AMORIM DE ANDRADE (12028001701)"]
[14,"DENIS RIBEIRO DO NASCIMENTO (10028003801)"]
[15,"DIANA BOAVENTURA GOMES JAKUBOWICZ (11028003501)"]
[16,"ELBERTH GONCALVES SALES (12028001401)"]
[17,"ERIKA PRISCILA SILVA MEIRELES (12028004201)"]
[18,"ERIVALDO FROS DO NASCIMENTO (11028004201)"]
[19,"ERMESSON CARVALHO DOS SANTOS (12028003201)"]
[20,"FABIANO CARVALHO DA COSTA (12028002101)"]
[21,"FABIO PANTOJA DE AGUIAR (11028003801)"]
[22,"FRANCIELY FARIAS DA CUNHA (10028001701)"]
[23,"FRANK RONALDO ARAUJO COSTA (10028003701)"]
[24,"GISELY CRISTINA SOUZA DA SILVA (09028003101)"]
[25,"GLAUCO MACHADO SILVA (11028003001)"]
[26,"HUGO ERNANDES SALDANHA CORREIA (10028000201)"]
[27,"IGOR ROBERTO DA COSTA AZEVEDO (12028003401)"]
[28,"IZA CAROLINE BULCAO FRANCA (10028002301)"]
[29,"JARDEL PINTO BARBOSA (09028005101)"]
[30,"JEFFERSON PINTO BARBOSA JUNIOR (10028004201)"]
[31,"JHENNY PRISCILA SOUZA DE OLIVEIRA (10028002401)"]
[32,"JOCIVALDO PEREIRA TAVARES (10028003501)"]
[33,"JOSE CARLOS ALBINO GONDIM (11028000101)"]
[34,"JOSIEL ABREU DO NASCIMENTO (09028004501)"]
[35,"JUCILEIDE GONCALVES BRITO (09028003801)"]
[36,"KAREN LARYSSA DA CRUZ TELES (11028003301)"]
[37,"KILVIA SORAYA LACERDA MIRANDA (12028002801)"]
[38,"LAIS CRISTINA DOS SANTOS MORAES (12028003301)"]
[39,"LEONARDO ANTONIO VERA DA COSTA (10028004301)"]
[40,"LILLIAN EDUARDA DA SILVA E SILVA (12028002601)"]
[41,"LUANA ANDRESSA FREITAS RIBEIRO PERES (09028003001)"]
[42,"LUCIENE SILVA DA SILVA (10028002001)"]
[43,"LUIZ OTAVIO FERREIRA SARDINHA (05028001001)"]
[44,"MARCO ANTONIO CUNHA BARBOSA (09028003301)"]
[45,"MARCOS RODRIGUES BARROS (12028003801)"]
[46,"MICHELLE DA COSTA SANTANA (11028001301)"]
[47,"MIRA KETLEN CARVALHO NASCIMENTO (11028000401)"]
[48,"NATALIA CYNTIA CORDEIRO DE SOUZA (10028003601)"]
[49,"NATHANNAEL CRISTIAN POMPEU DA SILVA (09028003401)"]
[50,"NAYARA DA COSTA OLIVEIRA (11028002401)"]
[51,"NILTON RENATO CAMPOS DOS SANTOS (11028002201)"]
[52,"OBEDE RODRIGUES CARDOSO (09028004101)"]
[53,"PATRICIA DO SOCORRO DOS ANJOS MONTEIRO (13028002201)"]
[54,"RAFAEL CERQUEIRA NASCIMENTO (10028001101)"]
[55,"RAYSSA CAROLINE DA CONCEICAO RIBEIRO (12028003501)"]
[56,"RODRIGO DA COSTA CARDOSO (12028002201)"]
[57,"ROGER CARDOSO QUARESMA (11028004301)"]
[58,"STEPHANIE LOPES LEAL (12028001601)"]
[59,"SUELLEN CRISTINA CARDIAS DE SENA LUCAS (11028001501)"]
[60,"THIAGO CARNEIRO CARVALHO (11028002001)"]
[61,"WEMENSON ASSUNCAO XAVIER SILVA (10028001901)"]

{"sheet":"Sorteio","index":1,"n_rows":5,"n_cols":7,"rows_kept":5,"cut":false,"hidden":false,"merged":[]}
["Sorteio de Aluno(a)",null,null,null,null,"Número:",{"$f":"COUNTA(Alunos!B1:B99)","v":61}]
[]
[]
[]
[2,{"$f":"VLOOKUP(A5,Alunos!A1:B99,2)","v":"ADELAINE BRANDAO SOARES (10028001201)"}]